Target
Sterol O-acyltransferase 1
Ligand
BDBM50371699
Substrate
Meas. Tech.
Inhibition Assay
IC50
65000±n/a nM
Citation
 Chang, TChang, CCShibuya, YBryleva, EMurphy, SRogers, MA Method for selectively inhibiting ACAT1 in the treatment of alzheimer's disease US Patent  US9149492 Publication Date 10/6/2015 
Target
Name:
Sterol O-acyltransferase 1
Synonyms:
ACACT ACAT Acetyl-CoA acetyltransferase, mitochondrial Acyl-CoA: cholesterol acyltransferase (ACAT) Cholesterol acyltransferase 1 SOAT1 STAT
Type:
Multi-pass membrane protein may form homo- or heterodimers.
Mol. Mass.:
64751.94
Organism:
Homo sapiens (Human)
Description:
P35610
Residue:
550
  
Inhibitor
Name:
BDBM50371699
Synonyms:
CHEMBL270041 | US9149492, 2
Type:
Small organic molecule
Emp. Form.:
C21H27NO
Mol. Mass.:
309.4452
SMILES:
CCCCCCCCC(=O)Nc1ccccc1-c1ccccc1
: