Target
Coagulation factor IX
Ligand
BDBM182990
Substrate
Meas. Tech.
Inhibition Assay
IC50
140±n/a nM
Citation
 Alet, NAltenburger, JHerault, JKirsch, RLassalle, GMallart, SPhilippo-Orts, M Sulphonylaminopyrrolidinone derivatives, their preparation and their therapeutic application US Patent  US9150544 Publication Date 10/6/2015 
Target
Name:
Coagulation factor IX
Synonyms:
Christmas factor Coagulation factor IX/VIII Coagulation factor IXa heavy chain F9 Factor IX Factor IXa (fIXa) Plasma thromboplastin component
Type:
Enzyme
Mol. Mass.:
51768.83
Organism:
Homo sapiens (Human)
Description:
P00740
Residue:
461
  
Inhibitor
Name:
BDBM182990
Synonyms:
US9150544, 24
Type:
Small organic molecule
Emp. Form.:
C24H28N6O6S
Mol. Mass.:
528.581
SMILES:
COc1cc2c(N)nccc2cc1C[C@@H](N1CC[C@H](NS(=O)(=O)c2ccc(nc2)N(C)C)C1=O)C(O)=O
: