Target
Coagulation factor IX
Ligand
BDBM183012
Substrate
Meas. Tech.
Inhibition Assay
IC50
130±n/a nM
Citation
 Alet, NAltenburger, JHerault, JKirsch, RLassalle, GMallart, SPhilippo-Orts, M Sulphonylaminopyrrolidinone derivatives, their preparation and their therapeutic application US Patent  US9150544 Publication Date 10/6/2015 
Target
Name:
Coagulation factor IX
Synonyms:
Christmas factor Coagulation factor IX/VIII Coagulation factor IXa heavy chain F9 Factor IX Factor IXa (fIXa) Plasma thromboplastin component
Type:
Enzyme
Mol. Mass.:
51768.83
Organism:
Homo sapiens (Human)
Description:
P00740
Residue:
461
  
Inhibitor
Name:
BDBM183012
Synonyms:
US9150544, 46
Type:
Small organic molecule
Emp. Form.:
C25H30N6O6S2
Mol. Mass.:
574.672
SMILES:
CCOc1cc2c(N)nccc2cc1C[C@@H](N1CC[C@H](NS(=O)(=O)c2cnc(s2)N2CCCC2)C1=O)C(O)=O
: