Target
Coagulation factor IX
Ligand
BDBM183053
Substrate
Meas. Tech.
Inhibition Assay
IC50
110±n/a nM
Citation
 Alet, NAltenburger, JHerault, JKirsch, RLassalle, GMallart, SPhilippo-Orts, M Sulphonylaminopyrrolidinone derivatives, their preparation and their therapeutic application US Patent  US9150544 Publication Date 10/6/2015 
Target
Name:
Coagulation factor IX
Synonyms:
Christmas factor Coagulation factor IX/VIII Coagulation factor IXa heavy chain F9 Factor IX Factor IXa (fIXa) Plasma thromboplastin component
Type:
Enzyme
Mol. Mass.:
51768.83
Organism:
Homo sapiens (Human)
Description:
P00740
Residue:
461
  
Inhibitor
Name:
BDBM183053
Synonyms:
US9150544, 87
Type:
Small organic molecule
Emp. Form.:
C24H24ClF3N6O6S
Mol. Mass.:
616.997
SMILES:
CN(C)c1ncc(cc1Cl)S(=O)(=O)N[C@H]1CCN([C@H](Cc2cc3ccnc(N)c3cc2OC(F)(F)F)C(O)=O)C1=O
: