Target
Coagulation factor IX
Ligand
BDBM183058
Substrate
Meas. Tech.
Inhibition Assay
IC50
120±n/a nM
Citation
 Alet, NAltenburger, JHerault, JKirsch, RLassalle, GMallart, SPhilippo-Orts, M Sulphonylaminopyrrolidinone derivatives, their preparation and their therapeutic application US Patent  US9150544 Publication Date 10/6/2015 
Target
Name:
Coagulation factor IX
Synonyms:
Christmas factor Coagulation factor IX/VIII Coagulation factor IXa heavy chain F9 Factor IX Factor IXa (fIXa) Plasma thromboplastin component
Type:
Enzyme
Mol. Mass.:
51768.83
Organism:
Homo sapiens (Human)
Description:
P00740
Residue:
461
  
Inhibitor
Name:
BDBM183058
Synonyms:
US9150544, 92
Type:
Small organic molecule
Emp. Form.:
C22H23ClN6O5S2
Mol. Mass.:
551.038
SMILES:
Nc1nccc2cc(C[C@@H](N3CC[C@H](NS(=O)(=O)c4cnc(s4)N4CCC4)C3=O)C(O)=O)c(Cl)cc12
: