Target
Genome polyprotein
Ligand
BDBM183493
Substrate
Meas. Tech.
FRET-Based Assay
Temperature
298.15±n/a K
IC50
77±n/a nM
Comments
extracted
Citation
 Woodhead, AJHamlett, CCBesong, GEChessari, GCarr, MGMillemaggi, ANorton, DSaalau-Bethell, SMWillems, HMThompson, NTHiscock, SD Pharmaceutical compounds US Patent  US9145354 Publication Date 9/29/2015 
Target
Name:
Genome polyprotein
Synonyms:
Dipeptidyl peptidase 4 (DPP4) NS3 NS5B NS3-4A Protease NS3/4A protease POLG_HCV77 | RNA polymerase (NS5B)
Type:
Protease Domain
Mol. Mass.:
327221.49
Organism:
Hepatitis C virus (HCV genotype 1a, isolate H)
Description:
P27958
Residue:
3011
  
Inhibitor
Name:
BDBM183493
Synonyms:
US9145354, 103
Type:
Small organic molecule
Emp. Form.:
C21H22ClFN2O2
Mol. Mass.:
388.863
SMILES:
C[C@@H](CC(N)=O)N[C@H](C1CC1)c1ccc(Cl)c(C(=O)c2ccccc2)c1F
: