Target
Genome polyprotein
Ligand
BDBM183497
Substrate
Meas. Tech.
FRET-Based Assay
Temperature
298.15±n/a K
IC50
70±n/a nM
Comments
extracted
Citation
 Woodhead, AJHamlett, CCBesong, GEChessari, GCarr, MGMillemaggi, ANorton, DSaalau-Bethell, SMWillems, HMThompson, NTHiscock, SD Pharmaceutical compounds US Patent  US9145354 Publication Date 9/29/2015 
Target
Name:
Genome polyprotein
Synonyms:
Dipeptidyl peptidase 4 (DPP4) NS3 NS5B NS3-4A Protease NS3/4A protease POLG_HCV77 | RNA polymerase (NS5B)
Type:
Protease Domain
Mol. Mass.:
327221.49
Organism:
Hepatitis C virus (HCV genotype 1a, isolate H)
Description:
P27958
Residue:
3011
  
Inhibitor
Name:
BDBM183497
Synonyms:
US9145354, 108
Type:
Small organic molecule
Emp. Form.:
C17H19ClFN3O2S
Mol. Mass.:
383.868
SMILES:
CC[C@@H](N[C@@H](C)CC(N)=O)c1ccc(Cl)c(C(=O)c2ccns2)c1F
: