Target
Orexin/Hypocretin receptor type 1
Ligand
BDBM184029
Substrate
Meas. Tech.
OX Inhibition Assay
Temperature
310.15±n/a K
IC50
2±n/a nM
Comments
extracted
Citation
 Bolli, MBoss, CBrotschi, CHeidmann, BSifferlen, TWilliams, JT 2-(1,2,3-triazol-2-yl)benzamide and 3-(1,2,3-triazol-2-YL)picolinamide derivatives as orexin receptor antagonists US Patent  US9150566 Publication Date 10/6/2015 
Target
Name:
Orexin/Hypocretin receptor type 1
Synonyms:
HCRTR1 OX1R_HUMAN Orexin receptor type 1 (OR 1) Orexin receptor type 1 (OX1) Orexin receptor type 1 (OxR1) | Ox1r
Type:
Protein
Mol. Mass.:
47554.50
Organism:
Homo sapiens (Human)
Description:
O43613
Residue:
425
  
Inhibitor
Name:
BDBM184029
Synonyms:
US9150566, 67
Type:
Small organic molecule
Emp. Form.:
C24H25N7O2
Mol. Mass.:
443.501
SMILES:
Cc1ccc(C(=O)N2CCOC[C@H]2Cc2ccc(C)c(c2)-n2nccn2)c(c1)-n1nccn1
: