Target
Orexin receptor type 2
Ligand
BDBM183968
Substrate
Meas. Tech.
OX Inhibition Assay
Temperature
310.15±n/a K
IC50
2950±n/a nM
Comments
extracted
Citation
 Bolli, MBoss, CBrotschi, CHeidmann, BSifferlen, TWilliams, JT 2-(1,2,3-triazol-2-yl)benzamide and 3-(1,2,3-triazol-2-YL)picolinamide derivatives as orexin receptor antagonists US Patent  US9150566 Publication Date 10/6/2015 
Target
Name:
Orexin receptor type 2
Synonyms:
HCRTR2 OX2R_HUMAN Orexin receptor type 2 (OR-2) Orexin receptor type 2 (OX2R) Ox-2-R | Ox2-R
Type:
Protein
Mol. Mass.:
50710.53
Organism:
Homo sapiens (Human)
Description:
O43614
Residue:
444
  
Inhibitor
Name:
BDBM183968
Synonyms:
US9150566, 5
Type:
Small organic molecule
Emp. Form.:
C25H24N6O3
Mol. Mass.:
456.4965
SMILES:
COc1ccc(C[C@@H]2COCCN2C(=O)c2ccccc2-n2nccn2)cc1-c1ncccn1
: