Target
Ribosomal protein S6 kinase alpha-2
Ligand
BDBM184202
Substrate
Meas. Tech.
Kinase Glo Plus Assay
pH
7.5±n/a
IC50
0.77±n/a nM
Comments
extracted
Citation
 Boyer, SJGao, DAGuo, XKirrane, Jr., TMSarko, CRSnow, RJSoleymanzadeh, FZhang, Y Heterocyclic compounds containing an indole core US Patent  US9150577 Publication Date 10/6/2015 
Target
Name:
Ribosomal protein S6 kinase alpha-2
Synonyms:
90 kDa ribosomal protein S6 kinase 2 KS6A2_HUMAN MAPKAPK1C RPS6KA2(Kin.Dom.1 - N-terminal) Ribosomal S6 Kinase 3 (RSK-3) Ribosomal protein S6 kinase alpha 2 (RSK2) p90-RSK 2 pp90RSK3
Type:
Serine/threonine-protein kinase
Mol. Mass.:
83259.46
Organism:
Homo sapiens (Human)
Description:
Residue:
733
  
Inhibitor
Name:
BDBM184202
Synonyms:
US9150577, 58
Type:
Small organic molecule
Emp. Form.:
C21H19N5O2
Mol. Mass.:
373.4079
SMILES:
CC1CCNC(=O)c2cc3ccc(cc3n12)C(=O)Nc1nc2ccccc2[nH]1
: