Target
Insulin receptor [964-1370]
Ligand
BDBM184361
Substrate
Meas. Tech.
DELFIA Assay
pH
7.4±n/a
IC50
0.51±n/a nM
Comments
extracted
Citation
 Treu, M 5,8-dihydro-6H-pyrazolo[3,4-h]quinazolines as IGF-1R/IR inhibitors US Patent  US9150578 Publication Date 10/6/2015 
Target
Name:
Insulin receptor [964-1370]
Synonyms:
INSR Insulin-like growth factor 1 receptor (aa 964-1370)
Type:
Mol. Mass.:
46101.87
Organism:
Homo sapiens (Human)
Description:
P06213[964-1370]
Residue:
407
  
Inhibitor
Name:
BDBM184361
Synonyms:
US9150578, I-009
Type:
Small organic molecule
Emp. Form.:
C27H28N10O
Mol. Mass.:
508.5776
SMILES:
CN(C)C(=O)Cn1ccc(Nc2ncc3CCc4nn(C)c(c4-c3n2)-c2ccc(cc2)-c2cnn(C)c2)n1
: