Target
Insulin receptor [964-1370]
Ligand
BDBM184378
Substrate
Meas. Tech.
DELFIA Assay
pH
7.4±n/a
IC50
0.28±n/a nM
Comments
extracted
Citation
 Treu, M 5,8-dihydro-6H-pyrazolo[3,4-h]quinazolines as IGF-1R/IR inhibitors US Patent  US9150578 Publication Date 10/6/2015 
Target
Name:
Insulin receptor [964-1370]
Synonyms:
INSR Insulin-like growth factor 1 receptor (aa 964-1370)
Type:
Mol. Mass.:
46101.87
Organism:
Homo sapiens (Human)
Description:
P06213[964-1370]
Residue:
407
  
Inhibitor
Name:
BDBM184378
Synonyms:
US9150578, I-026
Type:
Small organic molecule
Emp. Form.:
C29H26N10
Mol. Mass.:
514.5837
SMILES:
Cn1cc(cn1)-c1ccc(cc1)-c1c-2c(CCc3cnc(Nc4cnn(Cc5ccncc5)c4)nc-23)nn1C
: