Target
Epidermal growth factor receptor
Ligand
BDBM5456
Substrate
EGFR Substrate Peptide
Meas. Tech.
Kinase Inhibition Assay
pH
7.5±n/a
Temperature
296.15±n/a K
IC50
11±n/a nM
Citation
 Gaul, MDGuo, YAffleck, KCockerill, GSGilmer, TMGriffin, RJGuntrip, SKeith, BRKnight, WBMullin, RJMurray, DMRusnak, DWSmith, KTadepalli, SWood, ERLackey, K Discovery and biological evaluation of potent dual ErbB-2/EGFR tyrosine kinase inhibitors: 6-thiazolylquinazolines. Bioorg Med Chem Lett 13:637-40 (2003)  
Target
Name:
Epidermal growth factor receptor
Synonyms:
EGF Receptor Substrate EGFR_HUMAN ERBB1 Epidermal Growth Factor Receptor erbB-1 Epidermal growth factor receptor (EGFR) HER1 Proto-oncogene c-ErbB-1 Tyrosine-Protein Kinase ErbB-1
Type:
Receptor Kinase Domain
Mol. Mass.:
134279.59
Organism:
Homo sapiens (Human)
Description:
P00533
Residue:
1210
  
Inhibitor
Name:
BDBM5456
Synonyms:
6-alkoxy-4-anilinoquinazoline 8b | N-(3-ethynylphenyl)-6-{4-[(2-methanesulfonylethyl)amino]butoxy}quinazolin-4-amine
Type:
Small organic molecule
Emp. Form.:
C23H26N4O3S
Mol. Mass.:
438.543
SMILES:
CS(=O)(=O)CCNCCCCOc1ccc2ncnc(Nc3cccc(c3)C#C)c2c1
:
Substrate
Name:
EGFR Substrate Peptide
Synonyms:
Type:
Peptide
Mol. Mass.:
3934.43
Organism:
Description:
10 uM ATP as co-substrate.
Residue:
34