Target
Receptor tyrosine-protein kinase erbB-2
Ligand
BDBM5453
Substrate
ErbB-2 Substrate Peptide
Meas. Tech.
Kinase Inhibition Assay
pH
7.5±n/a
Temperature
296.15±n/a K
IC50
234±n/a nM
Citation
 Gaul, MDGuo, YAffleck, KCockerill, GSGilmer, TMGriffin, RJGuntrip, SKeith, BRKnight, WBMullin, RJMurray, DMRusnak, DWSmith, KTadepalli, SWood, ERLackey, K Discovery and biological evaluation of potent dual ErbB-2/EGFR tyrosine kinase inhibitors: 6-thiazolylquinazolines. Bioorg Med Chem Lett 13:637-40 (2003)  
Target
Name:
Receptor tyrosine-protein kinase erbB-2
Synonyms:
2.7.10.1 CD_antigen=CD340 ERBB2_HUMAN FASN/HER2 HER2 MLN19 NEU Proto-oncogene Neu Tyrosine kinase-type cell surface receptor HER2 | p185erbB2
Type:
Mol. Mass.:
137894.47
Organism:
Homo sapiens (Human)
Description:
P04626
Residue:
1255
  
Inhibitor
Name:
BDBM5453
Synonyms:
6-alkoxy-4-anilinoquinazoline 12a | N-[4-(benzyloxy)phenyl]-6-{3-[(2-methanesulfonylethyl)amino]propoxy}quinazolin-4-amine
Type:
Small organic molecule
Emp. Form.:
C27H30N4O4S
Mol. Mass.:
506.617
SMILES:
CS(=O)(=O)CCNCCCOc1ccc2ncnc(Nc3ccc(OCc4ccccc4)cc3)c2c1
:
Substrate
Name:
ErbB-2 Substrate Peptide
Synonyms:
Type:
Peptide
Mol. Mass.:
4131.76
Organism:
Description:
10 uM ATP as co-substrate.
Residue:
37