Target
Receptor tyrosine-protein kinase erbB-2
Ligand
BDBM5460
Substrate
ErbB-2 Substrate Peptide
Meas. Tech.
Kinase Inhibition Assay
pH
7.5±n/a
Temperature
296.15±n/a K
IC50
19±n/a nM
Citation
 Gaul, MDGuo, YAffleck, KCockerill, GSGilmer, TMGriffin, RJGuntrip, SKeith, BRKnight, WBMullin, RJMurray, DMRusnak, DWSmith, KTadepalli, SWood, ERLackey, K Discovery and biological evaluation of potent dual ErbB-2/EGFR tyrosine kinase inhibitors: 6-thiazolylquinazolines. Bioorg Med Chem Lett 13:637-40 (2003)  
Target
Name:
Receptor tyrosine-protein kinase erbB-2
Synonyms:
2.7.10.1 CD_antigen=CD340 ERBB2_HUMAN FASN/HER2 HER2 MLN19 NEU Proto-oncogene Neu Tyrosine kinase-type cell surface receptor HER2 | p185erbB2
Type:
Mol. Mass.:
137894.47
Organism:
Homo sapiens (Human)
Description:
P04626
Residue:
1255
  
Inhibitor
Name:
BDBM5460
Synonyms:
6-alkoxy-4-anilinoquinazoline 8f | N-{1-[(3-fluorophenyl)methyl]-1H-indazol-5-yl}-6-{4-[(2-methanesulfonylethyl)amino]butoxy}quinazolin-4-amine
Type:
Small organic molecule
Emp. Form.:
C29H31FN6O3S
Mol. Mass.:
562.658
SMILES:
CS(=O)(=O)CCNCCCCOc1ccc2ncnc(Nc3ccc4n(Cc5cccc(F)c5)ncc4c3)c2c1
:
Substrate
Name:
ErbB-2 Substrate Peptide
Synonyms:
Type:
Peptide
Mol. Mass.:
4131.76
Organism:
Description:
10 uM ATP as co-substrate.
Residue:
37