Target
Glycylpeptide N-tetradecanoyltransferase
Ligand
BDBM184646
Substrate
Meas. Tech.
Enzyme Inhibition Assay
pH
7.4±n/a
Temperature
298.15±n/a K
IC50
30000±n/a nM
Comments
extracted
Citation
 Brand, SWyatt, PThompson, SSmith, VBayliss, THarrison, JNorcross, NCleghorn, LGilbert, IBrenk, R N-myristoyl transferase inhibitors US Patent  US9156811 Publication Date 10/13/2015 
Target
Name:
Glycylpeptide N-tetradecanoyltransferase
Synonyms:
N-myristoyltransferase (NMT1)
Type:
Protein
Mol. Mass.:
50529.16
Organism:
Trypanosoma brucei
Description:
Q388H8
Residue:
446
  
Inhibitor
Name:
BDBM184646
Synonyms:
US9156811, DDD64750
Type:
Small organic molecule
Emp. Form.:
C14H19N3O4S
Mol. Mass.:
325.383
SMILES:
COc1ccc(OC)c(c1)[S+]([O-])(=O)Nc1c(C)nn(C)c1C
: