Target
Glycylpeptide N-tetradecanoyltransferase
Ligand
BDBM185023
Substrate
Meas. Tech.
Enzyme Inhibition Assay
pH
7.4±n/a
Temperature
298.15±n/a K
IC50
2±n/a nM
Comments
extracted
Citation
 Brand, SWyatt, PThompson, SSmith, VBayliss, THarrison, JNorcross, NCleghorn, LGilbert, IBrenk, R N-myristoyl transferase inhibitors US Patent  US9156811 Publication Date 10/13/2015 
Target
Name:
Glycylpeptide N-tetradecanoyltransferase
Synonyms:
N-myristoyltransferase (NMT1)
Type:
Protein
Mol. Mass.:
50529.16
Organism:
Trypanosoma brucei
Description:
Q388H8
Residue:
446
  
Inhibitor
Name:
BDBM185023
Synonyms:
US9156811, DDD99759
Type:
Small organic molecule
Emp. Form.:
C20H28Cl2N4O2S
Mol. Mass.:
459.433
SMILES:
Cc1nn(C)c(C)c1N[S+]([O-])(=O)c1c(Cl)cc(CCCC2CCNCC2)cc1Cl
: