Target
Glycylpeptide N-tetradecanoyltransferase 1
Ligand
BDBM184934
Substrate
Meas. Tech.
Enzyme Inhibition Assay
pH
7.4±n/a
Temperature
298.15±n/a K
IC50
130±n/a nM
Comments
extracted
Citation
 Brand, SWyatt, PThompson, SSmith, VBayliss, THarrison, JNorcross, NCleghorn, LGilbert, IBrenk, R N-myristoyl transferase inhibitors US Patent  US9156811 Publication Date 10/13/2015 
Target
Name:
Glycylpeptide N-tetradecanoyltransferase 1
Synonyms:
Myristoyl-CoA:protein N-myristoyltransferase (Nmt) NMT NMT1_HUMAN Peptide N-myristoyltransferase 1
Type:
Enzyme
Mol. Mass.:
56814.10
Organism:
Homo sapiens (Human)
Description:
P30419
Residue:
496
  
Inhibitor
Name:
BDBM184934
Synonyms:
US9156811, DDD88007
Type:
Small organic molecule
Emp. Form.:
C23H28Cl2N4O2S
Mol. Mass.:
495.465
SMILES:
CCN(CC)Cc1cccc(c1)-c1cc(Cl)c(c(Cl)c1)[S+]([O-])(=O)Nc1c(C)nn(C)c1C
: