Target
Ferrochelatase, mitochondrial [R115L]
Ligand
BDBM185148
Substrate
Meas. Tech.
Competition Binding Assays
Kd
3.0e+3±n/a nM
Citation
 Klaeger, SGohlke, BPerrin, JGupta, VHeinzlmeir, SHelm, DQiao, HBergamini, GHanda, HSavitski, MMBantscheff, MMédard, GPreissner, RKuster, B Chemical Proteomics Reveals Ferrochelatase as a Common Off-target of Kinase Inhibitors. ACS Chem Biol 11:1245-54 (2016)  
Target
Name:
Ferrochelatase, mitochondrial [R115L]
Synonyms:
FECH HEMH_HUMAN
Type:
Protein
Mol. Mass.:
47832.73
Organism:
Homo sapiens (Human)
Description:
Mutant R115L used for experiment
Residue:
423
  
Inhibitor
Name:
BDBM185148
Synonyms:
(3R,4R)-4-amino-1-[[4-(3-methoxyanilino)pyrrolo[2,1-f][1,2,4]triazin-5-yl]methyl]piperidin-3-ol | BMS-690514
Type:
Small organic molecule
Emp. Form.:
C19H24N6O2
Mol. Mass.:
368.4329
SMILES:
COc1cccc(Nc2ncnn3ccc(CN4CC[C@@H](N)[C@H](O)C4)c23)c1
: