Target
Protein-glutamine gamma-glutamyltransferase 2
Ligand
BDBM185168
Substrate
Meas. Tech.
TG Activity Assays
IC50
3.3e+3± 3e+2 nM
Citation
 Badarau, EWang, ZRathbone, DLCostanzi, AThibault, TMurdoch, CEEl Alaoui, SBartkeviciute, MGriffin, M Development of Potent and Selective Tissue Transglutaminase Inhibitors: Their Effect on TG2 Function and Application in Pathological Conditions. Chem Biol 22:1347-61 (2015)  
Target
Name:
Protein-glutamine gamma-glutamyltransferase 2
Synonyms:
Protein-glutamine gamma-glutamyltransferase TGM2 Tissue transglutaminase Transglutaminase 2 (TGM2) Transglutaminase-2
Type:
Protein
Mol. Mass.:
77309.30
Organism:
Homo sapiens (Human)
Description:
P21980
Residue:
687
  
Inhibitor
Name:
BDBM185168
Synonyms:
[2-[[2-[4-[(4-Methoxycarbonylphenyl)methoxycarbonyl]piperazin-1-yl]-2-oxo-ethyl]-amino]-2-oxo-ethyl]-dimethyl-sulfonium bromide (1b)
Type:
Small organic molecule
Emp. Form.:
C20H28N3O6S
Mol. Mass.:
438.517
SMILES:
COC(=O)c1ccc(COC(=O)N2CCN(CC2)C(=O)CNC(=O)C[S+](C)C)cc1
: