Target
Protein-glutamine gamma-glutamyltransferase 2
Ligand
BDBM185176
Substrate
Meas. Tech.
TG Activity Assays
IC50
775± 35 nM
Citation
 Badarau, EWang, ZRathbone, DLCostanzi, AThibault, TMurdoch, CEEl Alaoui, SBartkeviciute, MGriffin, M Development of Potent and Selective Tissue Transglutaminase Inhibitors: Their Effect on TG2 Function and Application in Pathological Conditions. Chem Biol 22:1347-61 (2015)  
Target
Name:
Protein-glutamine gamma-glutamyltransferase 2
Synonyms:
Protein-glutamine gamma-glutamyltransferase TGM2 Tissue transglutaminase Transglutaminase 2 (TGM2) Transglutaminase-2
Type:
Protein
Mol. Mass.:
77309.30
Organism:
Homo sapiens (Human)
Description:
P21980
Residue:
687
  
Inhibitor
Name:
BDBM185176
Synonyms:
[2-[[2-[4-(1-Adamantylmethoxycarbonyl)piperazin-1-yl]-2-oxo-ethyl]amino]-2-oxoethyl]-dimethyl-sulfonium bromide (1f)
Type:
Small organic molecule
Emp. Form.:
C22H36N3O4S
Mol. Mass.:
438.603
SMILES:
C[S+](C)CC(=O)NCC(=O)N1CCN(CC1)C(=O)OCC12CC3CC(CC(C3)C1)C2
: