Target
Protein-glutamine gamma-glutamyltransferase E
Ligand
BDBM185164
Substrate
Meas. Tech.
TG Activity Assays
IC50
>1.00e+5±n/a nM
Citation
 Badarau, EWang, ZRathbone, DLCostanzi, AThibault, TMurdoch, CEEl Alaoui, SBartkeviciute, MGriffin, M Development of Potent and Selective Tissue Transglutaminase Inhibitors: Their Effect on TG2 Function and Application in Pathological Conditions. Chem Biol 22:1347-61 (2015)  
Target
Name:
Protein-glutamine gamma-glutamyltransferase E
Synonyms:
Protein-glutamine glutamyltransferase E TGM3_HUMAN | Transglutaminase-3 (TG3)
Type:
Protein
Mol. Mass.:
76625.90
Organism:
Homo sapiens (Human)
Description:
Residue:
693
  
Inhibitor
Name:
BDBM185164
Synonyms:
(6-Methoxycarbonyl-2-naphthyl)methyl 4-[2-(prop-2-enoylamino)acetyl]piperazine-1-carboxylate (3d)
Type:
Small organic molecule
Emp. Form.:
C24H30N3O6S
Mol. Mass.:
488.576
SMILES:
COC(=O)c1ccc2cc(COC(=O)N3CCN(CC3)C(=O)CNC(=O)C[S+](C)C)ccc2c1
: