Target
Protein-glutamine gamma-glutamyltransferase E
Ligand
BDBM185180
Substrate
Meas. Tech.
TG Activity Assays
IC50
>1.00e+5±n/a nM
Citation
 Badarau, EWang, ZRathbone, DLCostanzi, AThibault, TMurdoch, CEEl Alaoui, SBartkeviciute, MGriffin, M Development of Potent and Selective Tissue Transglutaminase Inhibitors: Their Effect on TG2 Function and Application in Pathological Conditions. Chem Biol 22:1347-61 (2015)  
Target
Name:
Protein-glutamine gamma-glutamyltransferase E
Synonyms:
Protein-glutamine glutamyltransferase E TGM3_HUMAN | Transglutaminase-3 (TG3)
Type:
Protein
Mol. Mass.:
76625.90
Organism:
Homo sapiens (Human)
Description:
Residue:
693
  
Inhibitor
Name:
BDBM185180
Synonyms:
[2-[[2-(4-tert-Butoxycarbonylpiperazin-1-yl)-2-oxo-ethyl]amino]-2-oxo-ethyl]-dimethylsulfonium bromide (1m)
Type:
Small organic molecule
Emp. Form.:
C15H28N3O4S
Mol. Mass.:
346.465
SMILES:
C[S+](C)CC(=O)NCC(=O)N1CCN(CC1)C(=O)OC(C)(C)C
: