Target
Orexin/Hypocretin receptor type 1
Ligand
BDBM185325
Substrate
Meas. Tech.
Fluorescent Imaging Plate Reader (FLIPR) Assay
Temperature
310.15±n/a K
IC50
7±n/a nM
Comments
extracted
Citation
 Fieldhouse, CGlen, AMaine, SFujimoto, TRobinson, JS Cycloalkyl and heterocycloalkyl compounds as orexin receptor antagonists US Patent  US9156829 Publication Date 10/13/2015 
Target
Name:
Orexin/Hypocretin receptor type 1
Synonyms:
HCRTR1 OX1R_HUMAN Orexin receptor type 1 (OR 1) Orexin receptor type 1 (OX1) Orexin receptor type 1 (OxR1) | Ox1r
Type:
Protein
Mol. Mass.:
47554.50
Organism:
Homo sapiens (Human)
Description:
O43613
Residue:
425
  
Inhibitor
Name:
BDBM185325
Synonyms:
US10011588, Example 146 US9156829, 146
Type:
Small organic molecule
Emp. Form.:
C22H20F4N6O
Mol. Mass.:
460.4274
SMILES:
CC1(CCCC1NC(=O)c1ncccc1-c1ncccn1)Nc1ncc(cc1F)C(F)(F)F
: