Target
Cyclin-dependent kinase 1/G2/mitotic-specific cyclin-B
Ligand
BDBM5485
Substrate
Histone H1
Meas. Tech.
Kinase Inhibition Assay
IC50
7000±n/a nM
Citation
 Gibson, AEArris, CEBentley, JBoyle, FTCurtin, NJDavies, TGEndicott, JAGolding, BTGrant, SGriffin, RJJewsbury, PJohnson, LNMesguiche, VNewell, DRNoble, METucker, JAWhitfield, HJ Probing the ATP ribose-binding domain of cyclin-dependent kinases 1 and 2 with O(6)-substituted guanine derivatives. J Med Chem 45:3381-93 (2002)  
Target
Name:
Cyclin-dependent kinase 1/G2/mitotic-specific cyclin-B
Synonyms:
CDK1/Cyclin B p34cdc2/Cyclin B
Type:
Protein Complex
Mol. Mass.:
Description:
p34cdc2/cyclin B was purified from M-phase starfish oocytes by affinity chromatography.
Components:
This complex has 2 components.
Component 1
Name:
Cyclin-dependent kinase 1
Synonyms:
CDK1_ORYLA P34 protein kinase cdk1
Type:
Enzyme Subunit
Mol. Mass.:
34693.35
Organism:
Marthasterias glacialis (starfish)
Description:
Q9DGD3 {empty hard to find)
Residue:
303
  
Component 2
Name:
G2/mitotic-specific cyclin-B
Synonyms:
CCNB_MARGL G2/mitotic-specific cyclin-B1
Type:
Enzyme Subunit
Mol. Mass.:
43790.28
Organism:
Marthasterias glacialis (starfish)
Description:
Residue:
388
  
Inhibitor
Name:
BDBM5485
Synonyms:
6-(cyclohexylmethoxy)-9H-purin-2-amine NU2058
Type:
Small organic molecule
Emp. Form.:
C12H17N5O
Mol. Mass.:
247.2963
SMILES:
Nc1nc(OCC2CCCCC2)c2[nH]cnc2n1
:
Substrate
Name:
Histone H1
Synonyms:
Sigma Type IIIS
Type:
Other Protein Type
Mol. Mass.:
358.43
Organism:
Bos taurus (bovine)
Description:
12.5 uM ATP as co-substrate.
Residue:
3
NA