Target
Leucine-rich repeat serine/threonine-protein kinase 2
Ligand
BDBM185440
Substrate
Meas. Tech.
Lantha Screen Technology Assay
pH
7.5±n/a
IC50
32±n/a nM
Comments
extracted
Citation
 Galatsis, PHayward, MMKormos, BLWager, TTZhang, LStepan, AFHenderson, JLKurumbail, RGVerhoest, PR 4-(substituted amino)-7H-pyrrolo[2,3-d] pyrimidines as LRRK2 inhibitors US Patent  US9156845 Publication Date 10/13/2015 
Target
Name:
Leucine-rich repeat serine/threonine-protein kinase 2
Synonyms:
Dardarin LRRK2_HUMAN Leucine-rich repeat serine/threonine-protein kinase 2 PARK8
Type:
Protein
Mol. Mass.:
286113.20
Organism:
Homo sapiens (Human)
Description:
Q5S007
Residue:
2527
  
Inhibitor
Name:
BDBM185440
Synonyms:
US9156845, 89
Type:
Small organic molecule
Emp. Form.:
C17H17FN4O2
Mol. Mass.:
328.3409
SMILES:
OCc1cccc(-c2c[nH]c3ncnc(N4CCOCC4)c23)c1F
: