Target
Leucine-rich repeat serine/threonine-protein kinase 2 [G2019S]
Ligand
BDBM185395
Substrate
Meas. Tech.
Lantha Screen Technology Assay
pH
7.5±n/a
IC50
243±n/a nM
Comments
extracted
Citation
 Galatsis, PHayward, MMKormos, BLWager, TTZhang, LStepan, AFHenderson, JLKurumbail, RGVerhoest, PR 4-(substituted amino)-7H-pyrrolo[2,3-d] pyrimidines as LRRK2 inhibitors US Patent  US9156845 Publication Date 10/13/2015 
Target
Name:
Leucine-rich repeat serine/threonine-protein kinase 2 [G2019S]
Synonyms:
LRRK2 LRRK2_HUMAN Leucine-rich repeat serine/threonine-protein kinase 2 (LRRK2)(G2019S) PARK8
Type:
Mol. Mass.:
286143.23
Organism:
Homo sapiens (Human)
Description:
Q5S007(G2019S)
Residue:
2527
  
Inhibitor
Name:
BDBM185395
Synonyms:
US9156845, 39
Type:
Small organic molecule
Emp. Form.:
C19H20N6
Mol. Mass.:
332.4023
SMILES:
CN1CCCC(C1)Nc1ncnc2[nH]cc(-c3cccc(c3)C#N)c12
: