Target
Leucine-rich repeat serine/threonine-protein kinase 2 [G2019S]
Ligand
BDBM50059345
Substrate
Meas. Tech.
Lantha Screen Technology Assay
pH
7.5±n/a
IC50
13±n/a nM
Comments
extracted
Citation
 Galatsis, PHayward, MMKormos, BLWager, TTZhang, LStepan, AFHenderson, JLKurumbail, RGVerhoest, PR 4-(substituted amino)-7H-pyrrolo[2,3-d] pyrimidines as LRRK2 inhibitors US Patent  US9156845 Publication Date 10/13/2015 
Target
Name:
Leucine-rich repeat serine/threonine-protein kinase 2 [G2019S]
Synonyms:
LRRK2 LRRK2_HUMAN Leucine-rich repeat serine/threonine-protein kinase 2 (LRRK2)(G2019S) PARK8
Type:
Mol. Mass.:
286143.23
Organism:
Homo sapiens (Human)
Description:
Q5S007(G2019S)
Residue:
2527
  
Inhibitor
Name:
BDBM50059345
Synonyms:
CHEMBL3393355 | US9156845, 83
Type:
Small organic molecule
Emp. Form.:
C16H15ClN4O
Mol. Mass.:
314.77
SMILES:
Clc1cccc(c1)-c1c[nH]c2ncnc(N3CCOCC3)c12
: