Target
Leucine-rich repeat serine/threonine-protein kinase 2 [G2019S]
Ligand
BDBM185503
Substrate
Meas. Tech.
Lantha Screen Technology Assay
pH
7.5±n/a
IC50
46±n/a nM
Comments
extracted
Citation
 Galatsis, PHayward, MMKormos, BLWager, TTZhang, LStepan, AFHenderson, JLKurumbail, RGVerhoest, PR 4-(substituted amino)-7H-pyrrolo[2,3-d] pyrimidines as LRRK2 inhibitors US Patent  US9156845 Publication Date 10/13/2015 
Target
Name:
Leucine-rich repeat serine/threonine-protein kinase 2 [G2019S]
Synonyms:
LRRK2 LRRK2_HUMAN Leucine-rich repeat serine/threonine-protein kinase 2 (LRRK2)(G2019S) PARK8
Type:
Mol. Mass.:
286143.23
Organism:
Homo sapiens (Human)
Description:
Q5S007(G2019S)
Residue:
2527
  
Inhibitor
Name:
BDBM185503
Synonyms:
US9156845, 157
Type:
Small organic molecule
Emp. Form.:
C20H19FN6O3
Mol. Mass.:
410.4017
SMILES:
COc1ccc(F)cc1-c1c[nH]c2ncnc(N3CCOC(C3)c3noc(C)n3)c12
: