Target
Leucine-rich repeat serine/threonine-protein kinase 2 [G2019S]
Ligand
BDBM185526
Substrate
Meas. Tech.
Lantha Screen Technology Assay
pH
7.5±n/a
IC50
62±n/a nM
Comments
extracted
Citation
 Galatsis, PHayward, MMKormos, BLWager, TTZhang, LStepan, AFHenderson, JLKurumbail, RGVerhoest, PR 4-(substituted amino)-7H-pyrrolo[2,3-d] pyrimidines as LRRK2 inhibitors US Patent  US9156845 Publication Date 10/13/2015 
Target
Name:
Leucine-rich repeat serine/threonine-protein kinase 2 [G2019S]
Synonyms:
LRRK2 LRRK2_HUMAN Leucine-rich repeat serine/threonine-protein kinase 2 (LRRK2)(G2019S) PARK8
Type:
Mol. Mass.:
286143.23
Organism:
Homo sapiens (Human)
Description:
Q5S007(G2019S)
Residue:
2527
  
Inhibitor
Name:
BDBM185526
Synonyms:
US9156845, 180
Type:
Small organic molecule
Emp. Form.:
C18H16FN5O
Mol. Mass.:
337.3509
SMILES:
C[C@H]1CN(CCO1)c1ncnc2[nH]cc(-c3cccc(C#N)c3F)c12
: