Target
Bcl-2-like protein 1
Ligand
BDBM185624
Substrate
Meas. Tech.
Time Resolved-Fluorescence Resonance Energy Transfer (TR-FRET) Assay
Temperature
298.15±n/a K
Ki
2.067±n/a nM
Comments
extracted
Citation
 Kunzer, ARElmore, SWHexamer, LAPark, CSouers, AJSullivan, GMWang, GTWang, XWendt, MD Apoptosis-inducing agents for the treatment of cancer and immune and autoimmune diseases US Patent  US9156856 Publication Date 10/13/2015 
Target
Name:
Bcl-2-like protein 1
Synonyms:
Anti-apoptotic Bcl-2 protein Apoptosis regulator Bcl-X BCL2-like 1 isoform 1 BCL2L1 Bcl-2-like protein 1 (Bcl-XL) Bcl-xL/Bcl-2-binding component 3 Bcl2-antagonist of cell death (BAD)
Type:
Mitochondrion membrane; Single-pass membrane protein
Mol. Mass.:
26039.60
Organism:
Homo sapiens (Human)
Description:
Residue:
233
  
Inhibitor
Name:
BDBM185624
Synonyms:
US9156856, 35 | US9493431, 35
Type:
Small organic molecule
Emp. Form.:
C45H52ClN7O7S2
Mol. Mass.:
902.52
SMILES:
CC1(C)CCC(CN2CCN(CC2)c2ccc(C(=O)NS(=O)(=O)c3cc(c(NCCCN4CCOCC4)s3)[N+]([O-])=O)c(Oc3ccc4[nH]ccc4c3)c2)=C(C1)c1ccc(Cl)cc1
: