Target
Membrane primary amine oxidase
Ligand
BDBM50026182
Substrate
Meas. Tech.
Inhibition Assay
pH
7.2±n/a
Temperature
303.15±n/a K
IC50
700000±n/a nM
Comments
extracted
Citation
 Sayre, LM Amine oxidase inhibitors US Patent  US9161922 Publication Date 10/20/2015 
Target
Name:
Membrane primary amine oxidase
Synonyms:
AOC3 Plasma amine oxidase (BPAO)
Type:
Enzyme
Mol. Mass.:
84499.42
Organism:
Bos taurus (Bovine)
Description:
Q9TTK6
Residue:
763
  
Inhibitor
Name:
BDBM50026182
Synonyms:
3-Phenyl-prop-2-ynylamine US9161922, Table 1, Compound 3
Type:
Small organic molecule
Emp. Form.:
C9H9N
Mol. Mass.:
131.1745
SMILES:
NCC#Cc1ccccc1
: