Target
Tyrosine-protein kinase ABL1 [229-512]
Ligand
BDBM50237710
Substrate
Meas. Tech.
Kinome-Wide Inhibitor Profiling
Kd
11±2 nM
Citation
 Kwarcinski, FEBrandvold, KRPhadke, SBeleh, OMJohnson, TKMeagher, JLSeeliger, MAStuckey, JASoellner, MB Conformation-Selective Analogues of Dasatinib Reveal Insight into Kinase Inhibitor Binding and Selectivity. ACS Chem Biol 11:1296-304 (2016)  
Target
Name:
Tyrosine-protein kinase ABL1 [229-512]
Synonyms:
ABL ABL1_HUMAN Tyrosine-protein kinase ABL1 (c-Abl)
Type:
Protein
Mol. Mass.:
32850.19
Organism:
Homo sapiens (Human)
Description:
Human c-Abl kinase domain (229-512aa)
Residue:
284
  
Inhibitor
Name:
BDBM50237710
Synonyms:
4-methyl-N-[3-(4-methyl-1H-imidazol-1-yl)-5-(trifluoromethyl)phenyl]-3-[(4-pyridin-3-ylpyrimidin-2-yl)amino]benzamide AMN107 NILOTINIB | US11649218, Example Nilotinib
Type:
Small organic molecule
Emp. Form.:
C28H22F3N7O
Mol. Mass.:
529.5158
SMILES:
Cc1cn(cn1)-c1cc(NC(=O)c2ccc(C)c(Nc3nccc(n3)-c3cccnc3)c2)cc(c1)C(F)(F)F
: