Target
Tyrosine-protein kinase ABL1 [229-512]
Ligand
BDBM185670
Substrate
Meas. Tech.
Kinome-Wide Inhibitor Profiling for Phosphorylated c-Abl
Kd
1.8±0.2 nM
Citation
 Kwarcinski, FEBrandvold, KRPhadke, SBeleh, OMJohnson, TKMeagher, JLSeeliger, MAStuckey, JASoellner, MB Conformation-Selective Analogues of Dasatinib Reveal Insight into Kinase Inhibitor Binding and Selectivity. ACS Chem Biol 11:1296-304 (2016)  
Target
Name:
Tyrosine-protein kinase ABL1 [229-512]
Synonyms:
ABL ABL1_HUMAN Tyrosine-protein kinase ABL1 (c-Abl)
Type:
Protein
Mol. Mass.:
32850.19
Organism:
Homo sapiens (Human)
Description:
Human c-Abl kinase domain (229-512aa)
Residue:
284
  
Inhibitor
Name:
BDBM185670
Synonyms:
DAS-DFGO-I | N-(2-chloro-6-methylphenyl)-2-[[6-[4-(2-hydroxyethyl)piperazin-1-yl]-2-methylpyrimidin-4-yl]amino]-1,3-thiazole-5-carboxamide
Type:
Small organic molecule
Emp. Form.:
C29H29F3N8O3S
Mol. Mass.:
626.653
SMILES:
Cc1nc(Nc2ncc(s2)C(=O)Nc2cccc(NC(=O)c3cccc(c3)C(F)(F)F)c2)cc(n1)N1CCN(CCO)CC1
: