Target
5-hydroxytryptamine receptor 2C
Ligand
BDBM50395587
Substrate
Meas. Tech.
Radioligand Binding Assay
pH
7.4±n/a
Ki
115±n/a nM
Comments
extracted
Citation
 Jin, JRoth, BFrye, S Functionally selective ligands of dopamine D2 receptors US Patent  US9156822 Publication Date 10/13/2015 
Target
Name:
5-hydroxytryptamine receptor 2C
Synonyms:
5-HT-1C 5-HT1C 5-HT2C-INI 5-HTR2C 5-hydroxytryptamine receptor 2C (5-HT-2C) 5HT-1C HTR1C Serotonin (5-HT3) receptor Serotonin Receptor 2C
Type:
G Protein-Coupled Receptor (GPCR)
Mol. Mass.:
51836.79
Organism:
Homo sapiens (Human)
Description:
P28335
Residue:
458
  
Inhibitor
Name:
BDBM50395587
Synonyms:
CHEMBL2165126 US9156822, 2
Type:
Small organic molecule
Emp. Form.:
C24H29Cl2N3O2
Mol. Mass.:
462.412
SMILES:
Clc1cccc(N2CCCN(CCCCOc3ccc4CCC(=O)Nc4c3)CC2)c1Cl
: