Target
Protein-glutamine gamma-glutamyltransferase 2
Ligand
BDBM185744
Substrate
Meas. Tech.
Enzyme Inhibition Assay
IC50
>50000±n/a nM
Citation
 Pardin, CKeillor, JWLubell, WD Cinnamoyl inhibitors of transglutaminase US Patent  US9162991 Publication Date 10/20/2015 
Target
Name:
Protein-glutamine gamma-glutamyltransferase 2
Synonyms:
TGM2 Transglutaminases (TGase)
Type:
Enzyme
Mol. Mass.:
77122.36
Organism:
Cavia cutleri (Guinea pig)
Description:
P08587
Residue:
690
  
Inhibitor
Name:
BDBM185744
Synonyms:
US9162991, 20a
Type:
Small organic molecule
Emp. Form.:
C13H15NO4
Mol. Mass.:
249.2625
SMILES:
CC(C)(C)OC(=O)\C=C\c1ccc(cc1)[N+]([O-])=O
: