Target
Protein-glutamine gamma-glutamyltransferase 2
Ligand
BDBM185762
Substrate
Meas. Tech.
Enzyme Inhibition Assay
IC50
10700±1100 nM
Citation
 Pardin, CKeillor, JWLubell, WD Cinnamoyl inhibitors of transglutaminase US Patent  US9162991 Publication Date 10/20/2015 
Target
Name:
Protein-glutamine gamma-glutamyltransferase 2
Synonyms:
TGM2 Transglutaminases (TGase)
Type:
Enzyme
Mol. Mass.:
77122.36
Organism:
Cavia cutleri (Guinea pig)
Description:
P08587
Residue:
690
  
Inhibitor
Name:
BDBM185762
Synonyms:
US9162991, 4h
Type:
Small organic molecule
Emp. Form.:
C18H13N5O5
Mol. Mass.:
379.3263
SMILES:
[O-][N+](=O)c1cccc(Cn2cc(nn2)C(=O)\C=C\c2ccc(cc2)N(=O)=O)c1
: