Target
Protein-glutamine gamma-glutamyltransferase 2
Ligand
BDBM185763
Substrate
Meas. Tech.
Enzyme Inhibition Assay
IC50
>100000±n/a nM
Citation
 Pardin, CKeillor, JWLubell, WD Cinnamoyl inhibitors of transglutaminase US Patent  US9162991 Publication Date 10/20/2015 
Target
Name:
Protein-glutamine gamma-glutamyltransferase 2
Synonyms:
TGM2 Transglutaminases (TGase)
Type:
Enzyme
Mol. Mass.:
77122.36
Organism:
Cavia cutleri (Guinea pig)
Description:
P08587
Residue:
690
  
Inhibitor
Name:
BDBM185763
Synonyms:
US9162991, 4i
Type:
Small organic molecule
Emp. Form.:
C18H9F5N4O3
Mol. Mass.:
424.2811
SMILES:
Fc1c(F)c(F)c(Cn2cc(nn2)C(=O)\C=C\c2ccc(cc2)N(=O)=O)c(F)c1F
: