Target
Poly [ADP-ribose] polymerase tankyrase-1
Ligand
BDBM185795
Substrate
Meas. Tech.
Biochemical Assay
Temperature
298.15±n/a K
IC50
12.8±2.6 nM
Comments
extracted
Citation
 Chen, CHChin, DNDiPietro, LVFan, JPalermo, MGShultz, MDToure, B 4-piperidinyl compounds for use as tankyrase inhibitors US Patent  US9163003 Publication Date 10/20/2015 
Target
Name:
Poly [ADP-ribose] polymerase tankyrase-1
Synonyms:
(ARTD5 or PARP5a) PARPL Poly [ADP-ribose] polymerase tankyrase-1 TINF1 TNKS1 Tankyrase 1 Tankyrase-1 Tankyrase-1 (TNKS1)
Type:
Enzyme
Mol. Mass.:
142058.03
Organism:
Homo sapiens (Human)
Description:
O95271
Residue:
1327
  
Inhibitor
Name:
BDBM185795
Synonyms:
US9163003, 3 | USRE46942, Example 3
Type:
Small organic molecule
Emp. Form.:
C25H30N4O5
Mol. Mass.:
466.5295
SMILES:
COc1ccc(cc1)C(=O)C1CCN(CC1)[C@H]1CCN(Cc2nc3CCOCc3c(=O)[nH]2)C1=O
: