Target
Cell division cycle 7-related protein kinase
Ligand
BDBM185883
Substrate
Meas. Tech.
Inhibition Assay
pH
7.5±n/a
Ki
410±n/a nM
Comments
extracted
Target
Name:
Cell division cycle 7-related protein kinase
Synonyms:
CDC7 CDC7L1 Cell division cycle 7-related protein kinase (CDC7) huCdc7
Type:
Protein
Mol. Mass.:
63908.16
Organism:
Homo sapiens (Human)
Description:
O00311
Residue:
574
  
Inhibitor
Name:
BDBM185883
Synonyms:
US9163007, 320
Type:
Small organic molecule
Emp. Form.:
C18H18N6O2S
Mol. Mass.:
382.44
SMILES:
CCS(=O)(=O)Nc1n[nH]c2ccc(cc12)-c1cn(Cc2ccccc2)nn1
: