Target
Sodium channel protein type 9 subunit alpha
Ligand
BDBM186009
Substrate
Meas. Tech.
Electrophysiology Assay
pH
7.4±n/a
Ki
54±n/a nM
Comments
extracted
Citation
 Ni, CShao, BTafesse, LYao, JYoungman, MPark, M Pyrimidines as sodium channel blockers US Patent  US9163008 Publication Date 10/20/2015 
Target
Name:
Sodium channel protein type 9 subunit alpha
Synonyms:
NENA Peripheral sodium channel 1 SCN9A_HUMAN Voltage-gated sodium channel subunit Nav1.7 hNE-Na
Type:
Protein
Mol. Mass.:
226375.97
Organism:
Homo sapiens (Human)
Description:
Q15858
Residue:
1988
  
Inhibitor
Name:
BDBM186009
Synonyms:
US9163008, 98 | US9656968, Compound 98
Type:
Small organic molecule
Emp. Form.:
C21H17F3N4O4
Mol. Mass.:
446.3793
SMILES:
C[C@H](Oc1cc(nc(n1)-c1ccc(Oc2ccc(cc2)C(F)(F)F)cc1)C(N)=O)C(N)=O
: