Target
Voltage-dependent calcium channel gamma-8 subunit
Ligand
BDBM288190
Substrate
Meas. Tech.
Calcium Flux Assay
pH
7.4±n/a
IC50
0.398±n/a nM
Comments
extracted
Citation
 Ameriks, MKGyuris, MLaforteza, BNLebold, TPMeyer, STRavula, SSavall, BMShireman, BTWade, WSGerencsér, J Fused bicylic pyridine compounds and their use as AMPA receptor modulators US Patent  US10087185 Publication Date 10/2/2018 
Target
Name:
Voltage-dependent calcium channel gamma-8 subunit
Synonyms:
CACNG6 CCG8_HUMAN TARP gamma-8 | Transmembrane AMPAR regulatory protein gamma-8
Type:
Enzyme Catalytic Domain
Mol. Mass.:
43326.96
Organism:
Homo sapiens (Human)
Description:
Q8WXS5
Residue:
425
  
Inhibitor
Name:
BDBM288190
Synonyms:
5-(7-Methyl-1H-indazol-5-yl)-2-(difluoromethyl)-6- | US10087185, Example 8
Type:
Small organic molecule
Emp. Form.:
C16H10F5N5
Mol. Mass.:
367.2761
SMILES:
Cc1cc(cc2cn[nH]c12)-c1c(ccc2nc(nn12)C(F)F)C(F)(F)F
: