Target
Voltage-dependent calcium channel gamma-8 subunit
Ligand
BDBM288200
Substrate
Meas. Tech.
Calcium Flux Assay
pH
7.4±n/a
IC50
0.251±n/a nM
Comments
extracted
Citation
 Ameriks, MKGyuris, MLaforteza, BNLebold, TPMeyer, STRavula, SSavall, BMShireman, BTWade, WSGerencsér, J Fused bicylic pyridine compounds and their use as AMPA receptor modulators US Patent  US10087185 Publication Date 10/2/2018 
Target
Name:
Voltage-dependent calcium channel gamma-8 subunit
Synonyms:
CACNG6 CCG8_HUMAN TARP gamma-8 | Transmembrane AMPAR regulatory protein gamma-8
Type:
Enzyme Catalytic Domain
Mol. Mass.:
43326.96
Organism:
Homo sapiens (Human)
Description:
Q8WXS5
Residue:
425
  
Inhibitor
Name:
BDBM288200
Synonyms:
7-Chloro-5-(6-(difluoromethyl)-2-(trifluoromethyl)- | US10087185, Example 18
Type:
Small organic molecule
Emp. Form.:
C16H8ClF5N4O
Mol. Mass.:
402.706
SMILES:
FC(F)c1ccc2nc(nn2c1-c1cc2CC(=O)Nc2c(Cl)c1)C(F)(F)F
: