Target
Voltage-dependent calcium channel gamma-8 subunit
Ligand
BDBM288217
Substrate
Meas. Tech.
Calcium Flux Assay
pH
7.4±n/a
IC50
0.398±n/a nM
Comments
extracted
Citation
 Ameriks, MKGyuris, MLaforteza, BNLebold, TPMeyer, STRavula, SSavall, BMShireman, BTWade, WSGerencsér, J Fused bicylic pyridine compounds and their use as AMPA receptor modulators US Patent  US10087185 Publication Date 10/2/2018 
Target
Name:
Voltage-dependent calcium channel gamma-8 subunit
Synonyms:
CACNG6 CCG8_HUMAN TARP gamma-8 | Transmembrane AMPAR regulatory protein gamma-8
Type:
Enzyme Catalytic Domain
Mol. Mass.:
43326.96
Organism:
Homo sapiens (Human)
Description:
Q8WXS5
Residue:
425
  
Inhibitor
Name:
BDBM288217
Synonyms:
5-(7-Chloro-1H-indazol-5-yl)-2-ethyl-8-methyl-6-(trifluoromethyl)- | US10087185, Example 35
Type:
Small organic molecule
Emp. Form.:
C17H13ClF3N5
Mol. Mass.:
379.767
SMILES:
CCc1nc2c(C)cc(c(-c3cc(Cl)c4[nH]ncc4c3)n2n1)C(F)(F)F
: