Target
Voltage-dependent calcium channel gamma-8 subunit
Ligand
BDBM288245
Substrate
Meas. Tech.
Calcium Flux Assay
pH
7.4±n/a
IC50
0.016±n/a nM
Comments
extracted
Citation
 Ameriks, MKGyuris, MLaforteza, BNLebold, TPMeyer, STRavula, SSavall, BMShireman, BTWade, WSGerencsér, J Fused bicylic pyridine compounds and their use as AMPA receptor modulators US Patent  US10087185 Publication Date 10/2/2018 
Target
Name:
Voltage-dependent calcium channel gamma-8 subunit
Synonyms:
CACNG6 CCG8_HUMAN TARP gamma-8 | Transmembrane AMPAR regulatory protein gamma-8
Type:
Enzyme Catalytic Domain
Mol. Mass.:
43326.96
Organism:
Homo sapiens (Human)
Description:
Q8WXS5
Residue:
425
  
Inhibitor
Name:
BDBM288245
Synonyms:
5-(2,6-Bis(trifluoromethyl)pyrazolo[1,5-a]pyridin-7-yl)-7-chloro-1H- | US10087185, Example 63
Type:
Small organic molecule
Emp. Form.:
C16H7ClF6N4
Mol. Mass.:
404.697
SMILES:
FC(F)(F)c1cc2ccc(c(-c3cc(Cl)c4[nH]ncc4c3)n2n1)C(F)(F)F
: