Target
Voltage-dependent calcium channel gamma-8 subunit
Ligand
BDBM288295
Substrate
Meas. Tech.
Calcium Flux Assay
pH
7.4±n/a
IC50
0.316±n/a nM
Comments
extracted
Citation
 Ameriks, MKGyuris, MLaforteza, BNLebold, TPMeyer, STRavula, SSavall, BMShireman, BTWade, WSGerencsér, J Fused bicylic pyridine compounds and their use as AMPA receptor modulators US Patent  US10087185 Publication Date 10/2/2018 
Target
Name:
Voltage-dependent calcium channel gamma-8 subunit
Synonyms:
CACNG6 CCG8_HUMAN TARP gamma-8 | Transmembrane AMPAR regulatory protein gamma-8
Type:
Enzyme Catalytic Domain
Mol. Mass.:
43326.96
Organism:
Homo sapiens (Human)
Description:
Q8WXS5
Residue:
425
  
Inhibitor
Name:
BDBM288295
Synonyms:
7-Chloro-5-(2-cyclopropyl-6-(difluoromethyl)-8-methyl- | US10087185, Example 113
Type:
Small organic molecule
Emp. Form.:
C19H15ClF2N4O
Mol. Mass.:
388.798
SMILES:
Cc1cc(C(F)F)c(-c2cc3CC(=O)Nc3c(Cl)c2)n2nc(nc12)C1CC1
: