Target
Sodium channel protein type 10 subunit alpha
Ligand
BDBM161303
Substrate
Meas. Tech.
Electrophysiology Assay
IC50
12±n/a nM
Citation
 Anderson, CHadida-Ruah, SSGolec, JMZhang, BLittler, BJKeshavarz-Shokri, AAlacio, TEBelmont, DT Prodrugs of pyridone amides useful as modulators of sodium channels US Patent  US9163042 Publication Date 10/20/2015 
Target
Name:
Sodium channel protein type 10 subunit alpha
Synonyms:
SCNAA_RAT Sns Sodium channel protein type X alpha subunit | Voltage-gated sodium channel subunit alpha Nav1.8
Type:
Enzyme
Mol. Mass.:
219724.17
Organism:
Rattus norvegicus (Rat)
Description:
Q62968
Residue:
1956
  
Inhibitor
Name:
BDBM161303
Synonyms:
US10087143, Compound 88 US11673864, Compound 88 US9163042, 6a | US9758483, Compound 88
Type:
Small organic molecule
Emp. Form.:
C20H12F6N2O3
Mol. Mass.:
442.3113
SMILES:
Fc1ccc(Oc2cc(ccc2C(=O)Nc2cc[nH]c(=O)c2)C(F)(F)C(F)(F)F)cc1
: