Target
Sodium channel protein type 10 subunit alpha
Ligand
BDBM161244
Substrate
Meas. Tech.
Electrophysiology Assay
IC50
28±n/a nM
Citation
 Anderson, CHadida-Ruah, SSGolec, JMZhang, BLittler, BJKeshavarz-Shokri, AAlacio, TEBelmont, DT Prodrugs of pyridone amides useful as modulators of sodium channels US Patent  US9163042 Publication Date 10/20/2015 
Target
Name:
Sodium channel protein type 10 subunit alpha
Synonyms:
SCNAA_RAT Sns Sodium channel protein type X alpha subunit | Voltage-gated sodium channel subunit alpha Nav1.8
Type:
Enzyme
Mol. Mass.:
219724.17
Organism:
Rattus norvegicus (Rat)
Description:
Q62968
Residue:
1956
  
Inhibitor
Name:
BDBM161244
Synonyms:
US10087143, Compound 29 US10787472, Compound 11a US9051270, 29 US9758483, Compound 29
Type:
Small organic molecule
Emp. Form.:
C19H11ClF4N2O3
Mol. Mass.:
426.749
SMILES:
Fc1ccc(Oc2ccc(cc2C(=O)Nc2cc[nH]c(=O)c2)C(F)(F)F)c(Cl)c1
: