Target
Phosphatidylinositol 4-phosphate 3-kinase C2 domain-containing subunit alpha
Ligand
BDBM50200977
Substrate
Meas. Tech.
KINOMEscan Enzyme Binding Assays
Kd
617±n/a nM
Citation
 Mevellec, LAMeerpoel, LCoupa, SPoncelet, VSPilatte, INPasquier, ETBerthelot, DJQuerolle, OAMeyer, CAngibaud, PRDemestre, CGMercey, GJ Imidazopyridazine derivatives as PI3KB inhibitors US Patent  US10087187 Publication Date 10/2/2018 
Target
Name:
Phosphatidylinositol 4-phosphate 3-kinase C2 domain-containing subunit alpha
Synonyms:
P3C2A_HUMAN PIK3C2A Phosphatidylinositol-4-phosphate 3-kinase C2 domain-containing subunit alpha PtdIns-3-kinase C2 subunit alpha
Type:
Protein
Mol. Mass.:
190704.50
Organism:
Homo sapiens (Human)
Description:
O00443
Residue:
1686
  
Inhibitor
Name:
BDBM50200977
Synonyms:
CHEMBL3986383 | US10087187, Compound 5
Type:
Small organic molecule
Emp. Form.:
C23H23F3N6O
Mol. Mass.:
456.4635
SMILES:
Cc1nc2c(cc(nn2c1Cc1cccc(c1C)C(F)(F)F)N1CCOCC1)-c1cnc[nH]1
: