Target
Phosphatidylinositol 4-phosphate 3-kinase C2 domain-containing subunit beta
Ligand
BDBM288328
Substrate
Meas. Tech.
KINOMEscan Enzyme Binding Assays
Kd
2.00±n/a nM
Citation
 Mevellec, LAMeerpoel, LCoupa, SPoncelet, VSPilatte, INPasquier, ETBerthelot, DJQuerolle, OAMeyer, CAngibaud, PRDemestre, CGMercey, GJ Imidazopyridazine derivatives as PI3KB inhibitors US Patent  US10087187 Publication Date 10/2/2018 
Target
Name:
Phosphatidylinositol 4-phosphate 3-kinase C2 domain-containing subunit beta
Synonyms:
C2-PI3K PI3K-C2beta Phosphatidylinositol 4-phosphate 3-kinase C2 beta (PIK3C2B) Phosphoinositide 3-Kinase (PI3K), C2beta PtdIns-3-kinase C2 beta
Type:
Enzyme
Mol. Mass.:
184784.86
Organism:
Homo sapiens (Human)
Description:
O00750
Residue:
1634
  
Inhibitor
Name:
BDBM288328
Synonyms:
US10087187, Compound 18
Type:
Small organic molecule
Emp. Form.:
C25H26F3N7O2
Mol. Mass.:
513.5148
SMILES:
CC(=O)NCc1nc2c(cc(nn2c1Cc1cccc(c1C)C(F)(F)F)N1CCOCC1)-c1ncc[nH]1
: